{"text_format":"2","workbook":"xlsx","n_sheets":8,"sheets":["Table of Contents","1 - Contact Information","2 - Individual Debt Obligations","3 - Summary of Debt Obligations","Hide","4 - Additional Notes","5 - Optional Reporting","6 - Instructions and Glossary"],"not_rendered":{"charts":0,"images":0,"macros":0,"external_links":0,"defined_names":17,"comments":0,"pivot_tables":0},"unopened":[],"bounds":{"document_bytes":16777216,"sheet_cells":100000,"run_cost":"one","rows_first":2000,"rows_last":500,"rows_between":2000,"halvings":0,"cell_chars":16384,"cell_head_chars":4096},"cells_cut":0,"cells_raw":0,"read":"whole","date_system":"1900"}

{"sheet":"Table of Contents","index":0,"n_rows":9,"n_cols":1,"rows_kept":9,"cut":false,"hidden":false,"merged":[]}
["Texas Comptroller’s Annual Local Debt Report"]
["Table of Contents"]
["1 - Contact Information"]
["2 - Individual Debt Obligations"]
["3 - Summary of Debt Obligations"]
["4 - Additional Notes"]
["5 - Optional Reporting"]
["6 - Instructions and Glossary"]
["End of Worksheet"]

{"sheet":"1 - Contact Information","index":1,"n_rows":31,"n_cols":2,"rows_kept":31,"cut":false,"hidden":false,"merged":[]}
["Texas Comptroller’s Annual Local Debt Report"]
["Fill in the cells in column B that correspond with the requested information. (*) indicates required information. "]
["Entity Information"]
["Political Subdivision Name*:","City of Bryan, Texas"]
["Political Subdivision Type*:","City"]
["If \"other\", please specify"]
["Reporting Fiscal Year*:",2016]
["Fiscal Year Start (DD/MM/YYYY)*:","2015-10-01"]
["Fiscal Year End (auto):",{"$f":"IF(ISBLANK(B8),\"\",DATE(YEAR(B8)+1,MONTH(B8),DAY(B8)-1))","v":"2016-09-30"}]
["Political Subdivision Website, if applicable:","www.bryantx.gov"]
["Political Subdivision Telephone*:","979-209-5080"]
["Political Subdivision Email, if applicable:"]
["Does the Political Subdivision have any reportable debt?*","Yes"]
[]
["Contact Information"]
["Contact Name*:","Alicia Kenney"]
["Contact Title*:","General Accountant"]
["Contact Phone*:","979-209-5080"]
["Contact Email:","akenney@bryantx.gov"]
["Physical Address, Line 1*:","300 S. Texas Ave."]
{"$rows_left_out":12}
{"sheet":"2 - Individual Debt Obligations","index":2,"n_rows":111,"n_cols":19,"rows_kept":111,"cut":false,"hidden":false,"merged":[]}
["Texas Comptroller’s Annual Local Debt Report"]
["Entity Information (Auto)"]
["Political Subdivision Name:",{"$f":"IF('1 - Contact Information'!B4=\"\",\"\",'1 - Contact Information'!B4)","v":"City of Bryan, Texas"}]
["Reporting Fiscal Year:",{"$f":"IF(OR('1 - Contact Information'!B7=\"\",'1 - Contact Information'!B7=\"(select)\"),\"\",'1 - Contact Information'!B7)","v":2016}]
[]
["Directions: Beginning with the row immediately below the column headings, list each of the political subdivision's individual debt obligations along with the information for each obligation. Every column except B, Q, R and S is required for each debt obligation and must be provided for this report to be considered complete."]
["All information entered should reflect the last day of the political subdivision's fiscal year identified on this form. If the political subdivision has no debt to report for the fiscal year, enter \"No Reportable Debt\" in the first cell below the column title in column A."]
["Individual Debt Obligations (click column titles for more information)"]
["Outstanding debt obligation*","If debt is conduit or component debt, enter related entity name:","Principal issued*","Principal outstanding*","Combined principal and interest required to pay each outstanding debt obligation on time and in full*","Final maturity date* (MM/DD/YYYY)","Is the debt secured in any way by ad valorem taxes?*","Total proceeds received*","Proceeds spent*","Proceeds unspent*","Official stated purpose for which the debt obligation was authorized*","Is the debt obligation rated by any nationally recognized credit rating organization?*","Moody's","S&P","Fitch","Kroll","Other rating (if applicable)","Optional: Explanation of repayment source ","Optional: Comments or additional information per individual debt obligation"]
["General Obligation Refunding, Series 2010",null,10635000,5435000,6095400,"2021-08-15","Yes",11011119.4,11011119.4,{"$f":"H10-I10","v":0},"Proceeds from the sale of the Bonds will be used to refund a portion of the City’s outstanding general obligation debt and to pay certain costs of issuance of the Bonds. (Refunded Obligations include: 1998 CO's & 2001A Water & Wastewater CO's)","Yes","Aa3","AA","Not Rated","Not Rated"]
["General Obligation Refunding, Series 2013",null,27685000,22030000,25207538,"2026-08-15","Yes",27811772.399999999,27811772.399999999,{"$f":"H11-I11","v":0},"Proceeds from the sale of the Bonds will be used (1) for the acquisition, construction, replacement and repair ro the City's rural electric system; (2 )to refund a portion of the City's outstanding debt (the \"Refunded Obligations\"), for debt service savings, and (3) to pay costs of issuing the Obligations. (Refunded Obligations include: 2001, 2003, 2004, 2005 CO's, 2004 and 2005 Water & Wastewater Revenue Bonds) ","Yes","Not Rated","AA","Not Rated","Not Rated"]
["General Obligation Refunding, Series 2014",null,9245000,8050001,9805928,"2031-08-15","Yes",9322079.9100000001,9322079.9100000001,0,"Proceeds from the sale of the Bonds will be used (i) to refund a portion of the City’s outstanding debt (the “Refunded Obligations”), for debt service savings, and (ii) to pay the costs of issuing the Bonds. (Refunded obligations include 2005 CO's & 2005 Water & Wastewater Revenue Bonds)","Yes","Not Rated","AA","Not Rated","Not Rated"]
["General Obligation Refunding, Series 2015",null,19480000,17120000,19628425,"2025-08-15","Yes",20404064.510000002,20404064.510000002,{"$f":"H13-I13","v":0},"Proceeds from the sale of the Bonds will be used (i) to refund a portion of the City's outstanding debt (the \"Refunded Obligations\"), for debt service savings, and (ii) to pay costs of issuing the Bonds. (Refunded Obligations include: 2005 GO's & 2005 Electric Revenue Bonds)","Yes","Not Rated","AA","Not Rated","Not Rated"]
["General Obligation Refunding, Series 2016",null,7755000,7755000,8771772,"2026-08-15","Yes",8127164.9800000004,8127164.9800000004,{"$f":"H14-I14","v":0},"Proceeds from the sale of the Bonds will be used (i) to refund a portion of the City's outstanding debt (the \"Refunded Obligations\"), for debt service savings, and (ii) to pay costs of issuing the Bonds. (Refunded Obligations are 2007 CO's)","Yes","Not Rated","AA","Not Rated","Not Rated"]
["Certificate of Obligation-Combination Tax \n& Revenue, Series 2008",null,11090000,7450000,9806819,"2028-08-15","Yes",11137701.17,11137701.17,0,"Proceeds from the sale of the Certificates will be used to pay contractual obligations of the City incurred for (i) constructing street imrpovements, including traffic signalization, lighting, drainage facilities, sidewalks and landscaping associated therewith, (ii) constructing, improving and equipping fire fighting facilities, including the acquisition of sites therefor, (iii) constructing imrovements to driveway and parking facilities for the City's warehouse facility and (iv) professional services rendered in connection with the acquisition, construction and financing of the foregoing projects.","Yes","Aaa","AAA","Not Rated","Not Rated"]
["Certificate of Obligation-Combination Tax \n& Revenue, Series 2009",null,8730000,5970000,7946173,"2029-08-15","Yes",8840228.2200000007,8840228.2200000007,0,"Proceeds from the sale of the Certificates will be used to pay contractual obligations incurred for (i) constructing, improving, renovating, extending, expanding and developing streets, including drainage, traffic signalization, lighting, sidewalks, and landscaping; (ii) equipping a municipal golf course; and (iii) professional services, including legal, fiscal, engineering and design fees, and costs of issuance.","Yes","Aa3","AA","Not Rated","Not Rated"]
["Certificate of Obligation-Combination Tax \n& Revenue, Series 2010",null,13790000,9995000,13299538,"2030-08-15","Yes",13968726.189999999,{"$f":"14435079.64-1692633.01","v":12742446.630000001},1226279.5599999987,"Proceeds from the sale of the Certificates will be used to pay contractual obligations incurred for (i) constructing, improving, renovating, extending, expanding and developing streets, including drainage, traffic signalization, lighting, sidewalks, soundwalls and landscaping, and acquiring right-of-way related thereto,  (ii) restoring historic structures, (iii)acquiring, purchasing, constructing, improving, renovating, enlarging, and equipping property, buildings, structures, facilities, and related infrastructure for a solid waste disposal system, and (iv) professional services, including legal, fiscal, engineering and design fees, and costs of issuance.","Yes","Aa3","AA","Not Rated","Not Rated"]
["Certificate of Obligation-Combination Tax \n& Revenue Refunding, Series 2011, CTRR","Water & Wastewater",10785000,5590000,6283056,"2022-07-01","Yes",11387608.300000001,11387608.300000001,0,"Proceeds from the sale of the Bonds will be used to refund a portion of the City's outstanding System debt and to pay certain costs of issuance of the Bonds. (Refunded Obligations are 2001 Water & Wastewater Revenue Bonds)","Yes","Aa2","AA","Not Rated","Not Rated"]
["Certificate of Obligation-Combination Tax \n& Revenue, Series 2013","Bryan Texas Utilities",5600000,4950000,6913845,"2033-08-15","Yes",5652871.0999999996,{"$f":"H19-J19","v":5652871.0999999996},0,"Proceeds from the sale of the Bonds will be used for the acquisition, construction, replacement and repair of substations, feeders and other distribution improvements to the City's rural electric system.","Yes","Not Rated","AA","Not Rated","Not Rated"]
["Certificate of Obligation-Combination Tax \n& Revenue, Series 2014","Partial Bryan Texas \nUtilities",42615000,39490021,57054181,"2039-08-15","Yes",42683738.170000002,{"$f":"2774427.67+34770111.75","v":37544539.420000002},5139198.75,"Proceeds from the sale of the Certificates will be used for (i) the acquisition and construction of improvements, additions and extensions to the City’s electric system, including facilities for the transmission and distribution of electric power and energy, (ii) constructing, improving, renovating, extending, expanding and developing streets, including drainage, traffic signalization, lighting, sidewalks, soundwalls and landscaping, and acquiring right-of-way related thereto, (iii) the purchase of fire-fighting equipment, including fire trucks, and (iv) related professional services, including legal, fiscal, engineering and design fees, and costs of issuance of the Certificates.","Yes","Not Rated","AA","Not Rated","Not Rated"]
{"$rows_left_out":92}
{"sheet":"3 - Summary of Debt Obligations","index":3,"n_rows":25,"n_cols":2,"rows_kept":25,"cut":false,"hidden":false,"merged":[]}
["Texas Comptroller’s Annual Local Debt Report"]
["Entity Information (Auto)"]
["Political Subdivision Name:",{"$f":"IF('1 - Contact Information'!B4=\"\",\"\",'1 - Contact Information'!B4)","v":"City of Bryan, Texas"}]
["Reporting Fiscal Year:",{"$f":"IF(OR('1 - Contact Information'!B7=\"\",'1 - Contact Information'!B7=\"(select)\"),\"\",'1 - Contact Information'!B7)","v":2016}]
[]
["Directions: Fill in the cells in column B that correspond with the requested information. "]
["All information entered should reflect the last day of the political subdivision's fiscal year identified on this form."]
["If there is no debt to report for the fiscal year, enter \"N/A\" or \"$0\" in each cell along column B."]
["Total Tax-Supported and Revenue Debt "]
["Total authorized debt obligations:",{"$f":"SUM('2 - Individual Debt Obligations'!C10:C35)+13050000","v":571255000}]
["Total principal of all outstanding debt obligations:",{"$f":"SUM('2 - Individual Debt Obligations'!D10:D35)","v":420860022}]
["Combined principal and interest required to pay all outstanding debt obligations on time and in full:",{"$f":"SUM('2 - Individual Debt Obligations'!E10:E35)","v":585746078.43000007}]
[]
["Total debt secured by Ad Valorem Taxation (includes combination tax and revenue debt obligations) "]
["Total authorized debt obligations secured by ad valorem taxation:",{"$f":"SUM('2 - Individual Debt Obligations'!C10:C21)","v":177845000}]
["Total principal of all outstanding debt obligations secured by ad valorem taxation:",{"$f":"SUM('2 - Individual Debt Obligations'!D10:D21)","v":144270022}]
["Combined principal and interest required to pay all outstanding debt obligations secured by ad valorem taxation on time and in full:",{"$f":"SUM('2 - Individual Debt Obligations'!E10:E21)","v":184428158}]
[]
["Per Capita Total Debt secured by Ad Valorem Taxation  (required for municipalities, counties, and school districts only) "]
["Population of the political subdivision:",82118]
{"$rows_left_out":6}
{"sheet":"Hide","index":4,"n_rows":31,"n_cols":8,"rows_kept":31,"cut":false,"hidden":true,"merged":[]}
["(select)","(select)","(select)","Moody's","S&P","Fitch","Kroll","N/A - No Reportable Debt"]
["Yes","City",2016,"(select)","(select)","(select)","(select)"]
["No","County",{"$f":"C2+1","v":2017},"Not Rated","Not Rated","Not Rated","Not Rated"]
[null,"ISD",{"$f":"C3+1","v":2018},"Aaa","AAA","AAA","AAA"]
[null,"CCD",2019,"Aa1","AA+","AA+","AA"]
[null,"Water District",2020,"Aa2","AA","AA","A"]
[null,"Other",null,"Aa3","AA−","AA−","BBB"]
[null,null,null,"A1","A+","A+","BB"]
[null,null,null,"A2","A","A","B"]
[null,null,null,"A3","A−","A−","CCC"]
[null,null,null,"Baa1","BBB+","BBB+","CC"]
[null,null,null,"Baa2","BBB","BBB","C"]
[null,null,null,"Baa3","BBB−","BBB−","D"]
[null,null,null,"Ba1","BB+","BB+"]
[null,null,null,"Ba2","BB","BB"]
[null,null,null,"Ba3","BB−","BB−"]
[null,null,null,"B1","B+","B+"]
[null,null,null,"B2","B","B"]
[null,null,null,"B3","B−","B−"]
[null,null,null,"Caa","CCC","CCC"]
{"$rows_left_out":6}
{"sheet":"4 - Additional Notes","index":5,"n_rows":14,"n_cols":1,"rows_kept":14,"cut":false,"hidden":false,"merged":[]}
["Texas Comptroller’s Annual Local Debt Report"]
["Additional Notes (optional)"]
["Please use this space to enter any other information the political subdivision considers relevant or necessary to explain information submitted in this report."]
[1]
[2]
[3]
[4]
[5]
[6]
[7]
[8]
[9]
[10]
["End of Worksheet"]

{"sheet":"5 - Optional Reporting","index":6,"n_rows":30,"n_cols":5,"rows_kept":30,"cut":false,"hidden":false,"merged":[]}
["Texas Comptroller’s Annual Local Debt Report"]
["Optional Reporting"]
["Directions: Please complete each of the cells in the right-most column (column E) for all debt obligations in aggregate (or total) as of the last day of the political subdivision's most recently completed fiscal year."]
["For political subdivisions other than school districts, municipalities and counties"]
["Item #","Optional Item","Instructions","References, Local Government Code","Response"]
[1,"Total authorized debt obligations secured by ad valorem taxation expressed as a per capita amount for political subdivisions other than municipalities, school districts and counties. ","Sum all authorized debt obligations secured in any way by ad valorem taxation that have yet to be repaid. Include combination tax and revenue debt in this calculation. Divide this sum by the population of the political subdivision for the corresponding year of debt obligation data.","140.008(b)(3)(A)"]
[2,"Population total used to calculate per capita figure in #1:","The denominator used to calculate per capita figure requested in #1.This is a population total for your entity. ","140.008(b)(3)(A)"]
[3,"Source and year of population estimate used to calculate per capita figure in #1: ","The source of population data comprising the denominator of per capita figure in #1.","140.008(b)(3)(A)"]
[4,"Total principal on outstanding debt obligations secured by ad valorem taxation expressed as a per capita amount:","Sum the total amount borrowed of all obligations secured in any way by ad valorem taxation that have yet to be repaid. Include combination tax and revenue debt obligations in this total. Ensure that the population data matches time frame of the fiscal year for which you are reporting.","140.008(b)(3)(A)"]
[5,"Population total used to calculate per capita figure in #4:","The denominator used to calculate per capita figure requested in #4.This is a population total for your entity. ","140.008(b)(3)(A)"]
[6,"Source and year of population estimate used to calculate per capita figure in #4: ","The source of population data comprising the denominator of per capita figure in #4.","140.008(b)(3)(A)"]
[7,"Total combined principal and interest required to pay all outstanding ad valorem-secured debt obligations on time and in full, expressed as a per capita amount:","Sum the total amount borrowed of all obligations secured in any way by ad valorem taxation that have yet to be repaid. Include combination tax and revenue debt obligations in this total. Add to this the cost of debt service for these debt obligations. Divide this total by the population of the political subdivision. Ensure that the population data matches time frame of the fiscal year for which you are reporting.","140.008(b)(3)(A)"]
[8,"Population total used to calculate per capita figure in #7:","The denominator used to calculate per capita figure requested in #7.This is a population total for your entity. ","140.008(b)(3)(A)"]
[9,"Source and year of population estimate used to calculate per capita figure in #7: ","The source of population data comprising the denominator of per capita figure in #7.","140.008(b)(3)(A)"]
[]
["For all political subdivisions"]
["Item #","Optional Item","Instructions","References, Local Government Code","Response"]
[10,"Total authorized and outstanding debt obligations secured by ad valorem taxation, expressed as a per capita amount, projected as of the last day of the maximum term of the most recent debt obligation:","Sum any and all authorized debt obligations secured in any way by ad valorem taxation that have yet to be repaid. Include combination tax and revenue debt obligations in this total. Divide this by the projected population of the political subdivision as of the entity's last day of the maximum term of the most recently issued debt obligation. ","140.008(b)(3)(C)"]
[11,"Population projection total used to calculate per capita figure in #10:","The denominator used to calculate per capita figure requested in #10.This is a population projection total for your entity. ","140.008(b)(3)(C)"]
[12,"Source and year of population projection used to calculate per capita figure in #10: ","The source of population projection comprising the denominator of per capita figure in #10.","140.008(b)(3)(C)"]
{"$rows_left_out":11}
{"sheet":"6 - Instructions and Glossary","index":7,"n_rows":38,"n_cols":5,"rows_kept":38,"cut":false,"hidden":false,"merged":[]}
["Texas Comptroller’s Annual Local Debt Report"]
["Instructions and Glossary"]
["The tables below provide further guidance on properly completing this report. Please contact the Texas Comptroller's office if you have any further questions, by phone (844) 519-5676; or email, Transparency@cpa.texas.gov"]
["Tab 1: Contact Information"]
["Item #","Terms","Definitions ","Directions","References, Local Government Code"]
[1,"Political Subdivision Name","Political subdivisions are counties, municipalities, school districts, junior college districts, other special districts, or other subdivisions of state government (Local Government Code, section 140.008 (a) (2))","Enter the legal name of your political subdivision. ","140.008(2)"]
[2,"Political Subdivision Type","Political subdivisions are counties, municipalities, school districts, junior college districts, other special districts, or other subdivisions of state government (Local Government Code, section 140.008 (a) (2))","Click on the cell to access the drop down menu. Select the appropriate type of political entity from the list. If \"other\" is selected, the blank cell below it must specify the type. Selecting another entity will black the lower cell out.","140.008(2)"]
[3,"Does the Political Subdivision have reportable debt?","A political subdivision must annually compile and report the required financial information under Local Government Code, Section 140.008. There is not an exception to the filing requirement for a political subdivision with no outstanding debt.","Click on the cell to the right to access the drop down menu. Selecting \"No\" still requires tabs 2 and 3 to be completed. All contact and entity information needs to be completed regardless if there is no reportable debt.",140.00800000000001]
[]
["Tab 2: Individual Debt Obligations"]
["Column","Terms","Definitions ","Directions","References, Local Government Code"]
["column A","Outstanding debt obligation ","an issued public security, as defined under Government Code §1201.002, that has yet to be repaid.","Enter the name of the individual debt obligation or bond series. If the entity has no debt to report, enter \"No Reportable Debt\" in the first cell below the column title (row 10).","140.008(b)(1)(C)"]
["column B","If debt is conduit or component debt, enter related entity name","debt that is not a legal liability of the political subdivision but is secured by another entity, such as an Economic Development Corporation","Enter the name of the entity who the debt is issued to on behalf of the political subdivision.","N/A"]
["column C","Principal issued","total amount borrowed (par)","Enter the amount borrowed for each individual debt obligation or bond series.","140.008(b)(1)(G)(i)"]
["column D","Principal outstanding","total amount borrowed (par) of obligation that has yet to be repaid","Enter the amount borrowed that has yet to be repaid for each individual debt obligation or bond series. ","140.008(b)(1)(C)"]
["column E","Combined principal and interest required to pay each outstanding debt obligation on time and in full","the total amount borrowed (par) plus the cost of interest for each individual debt obligation or bond series","Enter the amount borrowed plus the cost of interest for each individual debt obligation or bond series; total debt service.","140.008(b)(1)(E )"]
["column F","Final maturity date","final payment date of individual debt obligation at which point all principal and interest will be paid off","Enter the date of the final payment of principal and interest for each individual debt obligation. ","140.008(b)(1)(G)(iii)"]
["column G","Is the debt secured in any way by ad valorem taxes?","indicates which individual debt obligations are in part or whole pledged with property taxes","Select \"Yes\" from the dropdown list if any part of the debt obligation is secured with ad valorem taxes. If not, select \"No\".","140.008(b)(1)(F)"]
["column H","Total proceeds received","total assets received from the sale of a new issue of public securities ","Enter the total assets received from the individual debt obligation. ","140.008(b)(1)(G)(ii)"]
["column I","Proceeds spent","the portion of total proceeds received (column H) that have been spent","Enter the portion of the total assets received from the individual debt obligation that have been spent. The spreadsheet automatically calculates this amount.","140.008(b)(1)(G)(ii)"]
{"$rows_left_out":18}